Target
Urea transporter 1
Ligand
BDBM50435310
Substrate
Meas. Tech.
ChEMBL_964780 (CHEMBL2394864)
IC50
353±n/a nM
Citation
 Liu, YEsteva-Font, CYao, CPhuan, PWVerkman, ASAnderson, MO 1,1-Difluoroethyl-substituted triazolothienopyrimidines as inhibitors of a human urea transport protein (UT-B): new analogs and binding model. Bioorg Med Chem Lett 23:3338-41 (2013)  
Target
Name:
Urea transporter 1
Synonyms:
Slc14a1 UT-B Urea transporter B | Urea transporter, erythrocyte
Type:
PROTEIN
Mol. Mass.:
42130.98
Organism:
Mus musculus
Description:
ChEMBL_964780
Residue:
384
  
Inhibitor
Name:
BDBM50435310
Synonyms:
CHEMBL2391346
Type:
Small organic molecule
Emp. Form.:
C20H15F2N5O3S2
Mol. Mass.:
475.492
SMILES:
CC(F)(F)c1ccc(cc1)S(=O)(=O)c1nnn2c3ccsc3c(NCc3ccco3)nc12
: