Target
Acetylcholinesterase
Ligand
BDBM50435602
Substrate
Meas. Tech.
ChEMBL_964213 (CHEMBL2395026)
IC50
>100000±n/a nM
Citation
 Razavi, SFKhoobi, MNadri, HSakhteman, AMoradi, AEmami, SForoumadi, AShafiee, A Synthesis and evaluation of 4-substituted coumarins as novel acetylcholinesterase inhibitors. Eur J Med Chem 64:252-9 (2013)  
Target
Name:
Acetylcholinesterase
Synonyms:
ACES_ELEEL Acetylcholinesterase (EeAChE) | ache
Type:
Enzyme
Mol. Mass.:
71812.79
Organism:
Electrophorus electricus (Electric eel)
Description:
Residue:
633
  
Inhibitor
Name:
BDBM50435602
Synonyms:
CHEMBL2390990
Type:
Small organic molecule
Emp. Form.:
C23H25NO6
Mol. Mass.:
411.4477
SMILES:
COc1ccc(CCNC(=O)CCCOc2cc(=O)oc3ccccc23)cc1OC
: