Target
Glucose-dependent insulinotropic receptor
Ligand
BDBM50435654
Substrate
Meas. Tech.
ChEMBL_964819 (CHEMBL2395065)
EC50
2120±n/a nM
Citation
 Zhang, JKLi, ARYu, MWang, YZhu, JKayser, FMedina, JCSiegler, KConn, MShan, BGrillo, MPEksterowicz, JCoward, PLiu, JJ Discovery and optimization of arylsulfonyl 3-(pyridin-2-yloxy)anilines as novel GPR119 agonists. Bioorg Med Chem Lett 23:3609-13 (2013)  
Target
Name:
Glucose-dependent insulinotropic receptor
Synonyms:
G-protein coupled receptor 119 (GPR119) GPR119 | Glucose-dependent insulinotropic receptor
Type:
Protein
Mol. Mass.:
36901.49
Organism:
Homo sapiens (Human)
Description:
Q8TDV5
Residue:
335
  
Inhibitor
Name:
BDBM50435654
Synonyms:
CHEMBL2391613
Type:
Small organic molecule
Emp. Form.:
C19H11ClF3N3O3S
Mol. Mass.:
453.822
SMILES:
FC(F)(F)c1ccc(C#N)c(Oc2cccc(NS(=O)(=O)c3ccc(Cl)cc3)c2)n1
: