Target
P2Y purinoceptor 1
Ligand
BDBM50436899
Substrate
Meas. Tech.
ChEMBL_971691 (CHEMBL2404230)
Ki
12±n/a nM
Citation
 Pi, ZSutton, JLloyd, JHua, JPrice, LWu, QChang, MZheng, JRehfuss, RHuang, CSWexler, RRLam, PY 2-Aminothiazole based P2Y(1) antagonists as novel antiplatelet agents. Bioorg Med Chem Lett 23:4206-9 (2013)  
Target
Name:
P2Y purinoceptor 1
Synonyms:
ATP receptor P2RY1_HUMAN P2Y1 Purinergic receptor P2Y1
Type:
Enzyme
Mol. Mass.:
42090.25
Organism:
Homo sapiens (Human)
Description:
P47900
Residue:
373
  
Inhibitor
Name:
BDBM50436899
Synonyms:
CHEMBL2401864
Type:
Small organic molecule
Emp. Form.:
C32H37F3N4O2S
Mol. Mass.:
598.722
SMILES:
CN(C)CC(C)(C)COc1cccc(c1)-c1sc(Nc2cccnc2Oc2ccccc2C(C)(C)C)nc1C(F)(F)F
: