Target
P2Y purinoceptor 1
Ligand
BDBM50436906
Substrate
Meas. Tech.
ChEMBL_971691 (CHEMBL2404230)
Ki
7.0±n/a nM
Citation
 Pi, ZSutton, JLloyd, JHua, JPrice, LWu, QChang, MZheng, JRehfuss, RHuang, CSWexler, RRLam, PY 2-Aminothiazole based P2Y(1) antagonists as novel antiplatelet agents. Bioorg Med Chem Lett 23:4206-9 (2013)  
Target
Name:
P2Y purinoceptor 1
Synonyms:
ATP receptor P2RY1_HUMAN P2Y1 Purinergic receptor P2Y1
Type:
Enzyme
Mol. Mass.:
42090.25
Organism:
Homo sapiens (Human)
Description:
P47900
Residue:
373
  
Inhibitor
Name:
BDBM50436906
Synonyms:
CHEMBL2401857
Type:
Small organic molecule
Emp. Form.:
C25H21F4N3OS
Mol. Mass.:
487.512
SMILES:
CC(C)(C)c1ccccc1Oc1ncccc1Nc1nc(c(s1)-c1ccccc1F)C(F)(F)F
: