Target
P2Y purinoceptor 1
Ligand
BDBM50436917
Substrate
Meas. Tech.
ChEMBL_971691 (CHEMBL2404230)
Ki
31±n/a nM
Citation
 Pi, ZSutton, JLloyd, JHua, JPrice, LWu, QChang, MZheng, JRehfuss, RHuang, CSWexler, RRLam, PY 2-Aminothiazole based P2Y(1) antagonists as novel antiplatelet agents. Bioorg Med Chem Lett 23:4206-9 (2013)  
Target
Name:
P2Y purinoceptor 1
Synonyms:
ATP receptor P2RY1_HUMAN P2Y1 Purinergic receptor P2Y1
Type:
Enzyme
Mol. Mass.:
42090.25
Organism:
Homo sapiens (Human)
Description:
P47900
Residue:
373
  
Inhibitor
Name:
BDBM50436917
Synonyms:
CHEMBL2401799
Type:
Small organic molecule
Emp. Form.:
C28H31N3OS
Mol. Mass.:
457.63
SMILES:
CC(C)(C)c1nc(Nc2cccnc2Oc2ccccc2C(C)(C)C)sc1-c1ccccc1
: