Target
Mineralocorticoid receptor
Ligand
BDBM50437575
Substrate
Meas. Tech.
ChEMBL_974220 (CHEMBL2411354)
IC50
2900±n/a nM
Citation
 Yang, CShen, HCWu, ZChu, HDCox, JMBalsells, JCrespo, ABrown, PZamlynny, BWiltsie, JClemas, JGibson, JContino, LLisnock, JZhou, GGarcia-Calvo, MBateman, TXu, LTong, XCrook, MSinclair, P Discovery of novel oxazolidinedione derivatives as potent and selective mineralocorticoid receptor antagonists. Bioorg Med Chem Lett 23:4388-92 (2013)  
Target
Name:
Mineralocorticoid receptor
Synonyms:
MCR MLR NR3C2 | Nuclear receptor subfamily 3 group C member 2
Type:
Enzyme
Mol. Mass.:
107076.42
Organism:
Homo sapiens (Human)
Description:
P08235
Residue:
984
  
Inhibitor
Name:
BDBM50437575
Synonyms:
CHEMBL2407650
Type:
Small organic molecule
Emp. Form.:
C27H28F3N3O7
Mol. Mass.:
563.5223
SMILES:
COc1cc(CNC(=O)[C@@]2(Cc3ccccc3)OC(=O)N(C3CCN(CC3)C(=O)C(F)(F)F)C2=O)cc(OC)c1
: