Target
Mineralocorticoid receptor
Ligand
BDBM50437578
Substrate
Meas. Tech.
ChEMBL_974220 (CHEMBL2411354)
IC50
14±n/a nM
Citation
 Yang, CShen, HCWu, ZChu, HDCox, JMBalsells, JCrespo, ABrown, PZamlynny, BWiltsie, JClemas, JGibson, JContino, LLisnock, JZhou, GGarcia-Calvo, MBateman, TXu, LTong, XCrook, MSinclair, P Discovery of novel oxazolidinedione derivatives as potent and selective mineralocorticoid receptor antagonists. Bioorg Med Chem Lett 23:4388-92 (2013)  
Target
Name:
Mineralocorticoid receptor
Synonyms:
MCR MLR NR3C2 | Nuclear receptor subfamily 3 group C member 2
Type:
Enzyme
Mol. Mass.:
107076.42
Organism:
Homo sapiens (Human)
Description:
P08235
Residue:
984
  
Inhibitor
Name:
BDBM50437578
Synonyms:
CHEMBL2407646
Type:
Small organic molecule
Emp. Form.:
C28H34N2O6
Mol. Mass.:
494.5794
SMILES:
COc1cc(CNC(=O)[C@@]2(Cc3ccccc3)OC(=O)N([C@H](C)C3CCCCC3)C2=O)cc(OC)c1
: