Target
Mineralocorticoid receptor
Ligand
BDBM50437582
Substrate
Meas. Tech.
ChEMBL_974220 (CHEMBL2411354)
IC50
500±n/a nM
Citation
 Yang, CShen, HCWu, ZChu, HDCox, JMBalsells, JCrespo, ABrown, PZamlynny, BWiltsie, JClemas, JGibson, JContino, LLisnock, JZhou, GGarcia-Calvo, MBateman, TXu, LTong, XCrook, MSinclair, P Discovery of novel oxazolidinedione derivatives as potent and selective mineralocorticoid receptor antagonists. Bioorg Med Chem Lett 23:4388-92 (2013)  
Target
Name:
Mineralocorticoid receptor
Synonyms:
MCR MLR NR3C2 | Nuclear receptor subfamily 3 group C member 2
Type:
Enzyme
Mol. Mass.:
107076.42
Organism:
Homo sapiens (Human)
Description:
P08235
Residue:
984
  
Inhibitor
Name:
BDBM50437582
Synonyms:
CHEMBL2407642
Type:
Small organic molecule
Emp. Form.:
C23H26N2O6
Mol. Mass.:
426.4623
SMILES:
COc1cc(CNC(=O)[C@@]2(Cc3ccccc3)OC(=O)N(C(C)C)C2=O)cc(OC)c1
: