Target
Mineralocorticoid receptor
Ligand
BDBM50437622
Substrate
Meas. Tech.
ChEMBL_974220 (CHEMBL2411354)
IC50
600±n/a nM
Citation
 Yang, CShen, HCWu, ZChu, HDCox, JMBalsells, JCrespo, ABrown, PZamlynny, BWiltsie, JClemas, JGibson, JContino, LLisnock, JZhou, GGarcia-Calvo, MBateman, TXu, LTong, XCrook, MSinclair, P Discovery of novel oxazolidinedione derivatives as potent and selective mineralocorticoid receptor antagonists. Bioorg Med Chem Lett 23:4388-92 (2013)  
Target
Name:
Mineralocorticoid receptor
Synonyms:
MCR MLR NR3C2 | Nuclear receptor subfamily 3 group C member 2
Type:
Enzyme
Mol. Mass.:
107076.42
Organism:
Homo sapiens (Human)
Description:
P08235
Residue:
984
  
Inhibitor
Name:
BDBM50437622
Synonyms:
CHEMBL2407677
Type:
Small organic molecule
Emp. Form.:
C29H24N2O4
Mol. Mass.:
464.5119
SMILES:
C[C@@H](N1C(=O)O[C@](Cc2ccccc2)(C(=O)Nc2ccc3ccccc3c2)C1=O)c1ccccc1
: