Target
Sigma non-opioid intracellular receptor 1
Ligand
BDBM50292909
Substrate
Meas. Tech.
ChEMBL_973122 (CHEMBL2412885)
Ki
220±n/a nM
Citation
 Li, JZhang, XZhang, ZPadakanti, PKJin, HCui, JLi, AZeng, DRath, NPFlores, HPerlmutter, JSParsons, SMTu, Z Heteroaromatic and aniline derivatives of piperidines as potent ligands for vesicular acetylcholine transporter. J Med Chem 56:6216-33 (2013)  
Target
Name:
Sigma non-opioid intracellular receptor 1
Synonyms:
OPRS1 SIGMAR1 Sigma non-opioid intracellular receptor 1 Sigma1-receptor Sterol isomerase-like protein
Type:
Protein
Mol. Mass.:
25307.17
Organism:
Cavia porcellus (Guinea pig)
Description:
Q60492
Residue:
223
  
Inhibitor
Name:
BDBM50292909
Synonyms:
(+/-)-trans-2-Hydroxy-3-(4-benzoylpiperidino)tetralin Hydrochloride CHEMBL473546
Type:
Small organic molecule
Emp. Form.:
C22H25NO2
Mol. Mass.:
335.4394
SMILES:
O[C@@H]1Cc2ccccc2C[C@H]1N1CCC(CC1)C(=O)c1ccccc1
: