Target
Vesicular acetylcholine transporter
Ligand
BDBM50437712
Substrate
Meas. Tech.
ChEMBL_973123 (CHEMBL2412886)
Ki
19±n/a nM
Citation
 Li, JZhang, XZhang, ZPadakanti, PKJin, HCui, JLi, AZeng, DRath, NPFlores, HPerlmutter, JSParsons, SMTu, Z Heteroaromatic and aniline derivatives of piperidines as potent ligands for vesicular acetylcholine transporter. J Med Chem 56:6216-33 (2013)  
Target
Name:
Vesicular acetylcholine transporter
Synonyms:
SLC18A3 VACHT | VACHT_HUMAN
Type:
PROTEIN
Mol. Mass.:
56900.67
Organism:
Homo sapiens (Human)
Description:
ChEMBL_1507628
Residue:
532
  
Inhibitor
Name:
BDBM50437712
Synonyms:
CHEMBL2409367
Type:
Small organic molecule
Emp. Form.:
C23H28N2O2
Mol. Mass.:
364.4806
SMILES:
CNc1ccc(cc1)C(=O)C1CCN(CC1)C1Cc2ccccc2CC1O
: