Target
Vesicular acetylcholine transporter
Ligand
BDBM50437723
Substrate
Meas. Tech.
ChEMBL_973123 (CHEMBL2412886)
Ki
13±n/a nM
Citation
 Li, JZhang, XZhang, ZPadakanti, PKJin, HCui, JLi, AZeng, DRath, NPFlores, HPerlmutter, JSParsons, SMTu, Z Heteroaromatic and aniline derivatives of piperidines as potent ligands for vesicular acetylcholine transporter. J Med Chem 56:6216-33 (2013)  
Target
Name:
Vesicular acetylcholine transporter
Synonyms:
SLC18A3 VACHT | VACHT_HUMAN
Type:
PROTEIN
Mol. Mass.:
56900.67
Organism:
Homo sapiens (Human)
Description:
ChEMBL_1507628
Residue:
532
  
Inhibitor
Name:
BDBM50437723
Synonyms:
CHEMBL2409372
Type:
Small organic molecule
Emp. Form.:
C21H23FN2O2
Mol. Mass.:
354.4179
SMILES:
O[C@@H]1Cc2ccccc2C[C@H]1N1CCC(CC1)C(=O)c1cccnc1F
: