Target
Toll-like receptor 8
Ligand
BDBM50439266
Substrate
Meas. Tech.
ChEMBL_980713 (CHEMBL2423795)
EC50
24400±n/a nM
Citation
 Kokatla, HPSil, DMalladi, SSBalakrishna, RHermanson, ARFox, LMWang, XDixit, ADavid, SA Exquisite selectivity for human toll-like receptor 8 in substituted furo[2,3-c]quinolines. J Med Chem 56:6871-85 (2013)  
Target
Name:
Toll-like receptor 8
Synonyms:
CD_antigen: CD288 TLR8_HUMAN | TRL8
Type:
Enzyme
Mol. Mass.:
119828.77
Organism:
Homo sapiens (Human)
Description:
Q9NR97
Residue:
1041
  
Inhibitor
Name:
BDBM50439266
Synonyms:
CHEMBL2419471
Type:
Small organic molecule
Emp. Form.:
C10H12N2O
Mol. Mass.:
176.2151
SMILES:
CCCc1cc2ccnc(N)c2o1
: