Target
Substance-P receptor
Ligand
BDBM50439329
Substrate
Meas. Tech.
ChEMBL_977574 (CHEMBL2423356)
Ki
0.089000±n/a nM
Citation
 Nair, PYamamoto, TLargent-Milnes, TMCowell, SKulkarni, VMoye, SNavratilova, EDavis, PMa, SWVanderah, TWLai, JPorreca, FHruby, VJ Truncation of the peptide sequence in bifunctional ligands with mu and delta opioid receptor agonist and neurokinin 1 receptor antagonist activities. Bioorg Med Chem Lett 23:4975-8 (2013)  
Target
Name:
Substance-P receptor
Synonyms:
NK-1 receptor NK1 Receptor Neurokinin 1 receptor SPR Tac1r Tacr1
Type:
G Protein-Coupled Receptor (GPCR)
Mol. Mass.:
46371.54
Organism:
Rattus norvegicus (rat)
Description:
Competition binding assays were carried out using membrane preparations from transfected CHO cells that constitutively expressed the rat NK1 receptor.
Residue:
407
  
Inhibitor
Name:
BDBM50439329
Synonyms:
CHEMBL2419542
Type:
Small organic molecule
Emp. Form.:
C49H53F6N7O8
Mol. Mass.:
981.9776
SMILES:
CC(C)C[C@H](NC(=O)[C@H](Cc1ccccc1)NC(=O)CNC(=O)[C@@H](C)NC(=O)[C@@H](N)Cc1ccc(O)cc1)C(=O)N[C@@H](Cc1c[nH]c2ccccc12)C(=O)OCc1cc(cc(c1)C(F)(F)F)C(F)(F)F
: