Target
Glucocorticoid receptor
Ligand
BDBM50440240
Substrate
Meas. Tech.
ChEMBL_982006 (CHEMBL2428210)
EC50
127±n/a nM
Citation
 Sheppeck, JEGilmore, JLXiao, HYDhar, TGNirschl, DDoweyko, AMSack, JSCorbett, MJMalley, MFGougoutas, JZMckay, LCunningham, MDHabte, SFDodd, JHNadler, SGSomerville, JEBarrish, JC Discovery of potent and selective nonsteroidal indazolyl amide glucocorticoid receptor agonists. Bioorg Med Chem Lett 23:5442-7 (2013)  
Target
Name:
Glucocorticoid receptor
Synonyms:
GCR_HUMAN GRL Glucocorticoid receptor (GRFP) Nuclear receptor subfamily 3 group C member 1
Type:
Enzyme
Mol. Mass.:
85656.87
Organism:
Homo sapiens (Human)
Description:
P04150
Residue:
777
  
Inhibitor
Name:
BDBM50440240
Synonyms:
CHEMBL2426647
Type:
Small organic molecule
Emp. Form.:
C25H22N6OS
Mol. Mass.:
454.547
SMILES:
CC(C)(C(c1ccccc1)c1ccc2n(ncc2c1)-c1ccccn1)C(=O)Nc1nncs1
: