Target
Dipeptidyl peptidase 9
Ligand
BDBM50440468
Substrate
Meas. Tech.
ChEMBL_982812 (CHEMBL2429189)
IC50
>100000±n/a nM
Citation
 Xie, HZeng, LZeng, SLu, XZhao, XZhang, GTu, ZXu, HYang, LZhang, XWang, SHu, W Highly potent dipeptidyl peptidase IV inhibitors derived from Alogliptin through pharmacophore hybridization and lead optimization. Eur J Med Chem 68:312-20 (2013)  
Target
Name:
Dipeptidyl peptidase 9
Synonyms:
DPP9 DPRP-2 Dipeptidyl peptidase 9 (DDP9) Dipeptidyl peptidase 9 (DPP9) Dipeptidyl peptidase IX Dipeptidyl peptidase-like protein 9
Type:
Enzyme
Mol. Mass.:
98260.70
Organism:
Homo sapiens (Human)
Description:
Q86TI2
Residue:
863
  
Inhibitor
Name:
BDBM50440468
Synonyms:
CHEMBL2425885
Type:
Small organic molecule
Emp. Form.:
C21H24N6O2
Mol. Mass.:
392.4543
SMILES:
CC#CCn1c(cc(=O)n(Cc2nc3ccccc3[nH]2)c1=O)N1CCC[C@@H](N)C1
: