Target
Dipeptidyl peptidase 8
Ligand
BDBM50440461
Substrate
Meas. Tech.
ChEMBL_982811 (CHEMBL2429188)
IC50
>100000±n/a nM
Citation
 Xie, HZeng, LZeng, SLu, XZhao, XZhang, GTu, ZXu, HYang, LZhang, XWang, SHu, W Highly potent dipeptidyl peptidase IV inhibitors derived from Alogliptin through pharmacophore hybridization and lead optimization. Eur J Med Chem 68:312-20 (2013)  
Target
Name:
Dipeptidyl peptidase 8
Synonyms:
DPP8 DPRP-1 Dipeptidyl peptidase 8 (DPP-8) Dipeptidyl peptidase 8/9 Dipeptidyl peptidase VIII Prolyl dipeptidase DPP8
Type:
Enzyme
Mol. Mass.:
103342.62
Organism:
Homo sapiens (Human)
Description:
Q6V1X1
Residue:
898
  
Inhibitor
Name:
BDBM50440461
Synonyms:
CHEMBL2425892
Type:
Small organic molecule
Emp. Form.:
C24H27N5O3
Mol. Mass.:
433.5029
SMILES:
COc1ccc2nc(Cn3c(=O)cc(N4CCC[C@@H](N)C4)n(CC#CC)c3=O)ccc2c1
: