Target
Proteinase-activated receptor 2
Ligand
BDBM50440859
Substrate
Meas. Tech.
ChEMBL_984132 (CHEMBL2434653)
EC50
8000±n/a nM
Citation
 Yau, MKLiu, LFairlie, DP Toward drugs for protease-activated receptor 2 (PAR2). J Med Chem 56:7477-97 (2013)  
Target
Name:
Proteinase-activated receptor 2
Synonyms:
F2RL1 PAR2 | PAR2_HUMAN
Type:
PROTEIN
Mol. Mass.:
44152.54
Organism:
Homo sapiens (Human)
Description:
ChEMBL_1497756
Residue:
397
  
Inhibitor
Name:
BDBM50440859
Synonyms:
CHEMBL2431718
Type:
Small organic molecule
Emp. Form.:
C100H178N30O26S
Mol. Mass.:
2248.734
SMILES:
[#6]-[#6]-[#6]-[#6]-[#6]-[#6]-[#6]-[#6]-[#6]-[#6]-[#6]-[#6]-[#6]-[#6]-[#6]-[#6](=O)-[#7]-[#6@@H](-[#6]-[#6]-[#6]\[#7]=[#6](/[#7])-[#7])-[#6](=O)-[#7]-[#6@@H](-[#6]-[#16])-[#6](=O)-[#7]-[#6@@H](-[#6]-[#6](-[#6])-[#6])-[#6](=O)-[#7]-[#6@@H](-[#6]-[#8])-[#6](=O)-[#7]-[#6@@H](-[#6]-[#8])-[#6](=O)-[#7]-[#6@@H](-[#6]-[#8])-[#6](=O)-[#7]-[#6@@H](-[#6])-[#6](=O)-[#7]-[#6@@H](-[#6](-[#6])-[#6])-[#6](=O)-[#7]-[#6@@H](-[#6])-[#6](=O)-[#7]-[#6@@H](-[#6]-[#6](-[#7])=O)-[#6](=O)-[#7]-[#6@@H](-[#6]-[#6]-[#6]\[#7]=[#6](/[#7])-[#7])-[#6](=O)-[#7]-[#6@@H](-[#6]-[#8])-[#6](=O)-[#7]-[#6@@H](-[#6]-[#6]-[#6]-[#6]-[#7])-[#6](=O)-[#7]-[#6@@H](-[#6]-[#6]-[#6]-[#6]-[#7])-[#6](=O)-[#7]-[#6@@H](-[#6]-[#8])-[#6](=O)-[#7]-[#6@@H](-[#6]-[#6]-[#6]\[#7]=[#6](/[#7])-[#7])-[#6](=O)-[#7]-[#6@@H](-[#6]-[#6](-[#6])-[#6])-[#6](=O)-[#7]-[#6@@H](-[#6]-c1ccccc1)-[#6](-[#8])=O
: