Target
Cytochrome P450 2C9
Ligand
BDBM50445222
Substrate
Meas. Tech.
ChEMBL_1284942 (CHEMBL3108383)
IC50
7400±n/a nM
Citation
 Gentry, PRKokubo, MBridges, TMKett, NRHarp, JMCho, HPSmith, EChase, PHodder, PSNiswender, CMDaniels, JSConn, PJWood, MRLindsley, CW Discovery of the first M5-selective and CNS penetrant negative allosteric modulator (NAM) of a muscarinic acetylcholine receptor: (S)-9b-(4-chlorophenyl)-1-(3,4-difluorobenzoyl)-2,3-dihydro-1H-imidazo[2,1-a]isoindol-5(9bH)-one (ML375). J Med Chem 56:9351-5 (2013)  
Target
Name:
Cytochrome P450 2C9
Synonyms:
(R)-limonene 6-monooxygenase CP2C9_HUMAN CYP2C9 Cytochrome P450 2C9 (CYP2C9 ) P-450MP P450 PB-1 | S-mephenytoin 4-hydroxylase
Type:
Enzyme
Mol. Mass.:
55636.33
Organism:
Homo sapiens (Human)
Description:
P11712
Residue:
490
  
Inhibitor
Name:
BDBM50445222
Synonyms:
CHEMBL3105228
Type:
Small organic molecule
Emp. Form.:
C23H15ClF2N2O2
Mol. Mass.:
424.827
SMILES:
Fc1ccc(cc1F)C(=O)N1CCN2C(=O)c3ccccc3[C@@]12c1ccc(Cl)cc1
: