Target
Perforin-1
Ligand
BDBM50445287
Substrate
Meas. Tech.
ChEMBL_1285138 (CHEMBL3106784)
IC50
2550±n/a nM
Citation
 Spicer, JALena, GLyons, DMHuttunen, KMMiller, CKO'Connor, PDBull, MHelsby, NJamieson, SMDenny, WACiccone, ABrowne, KALopez, JARudd-Schmidt, JVoskoboinik, ITrapani, JA Exploration of a series of 5-arylidene-2-thioxoimidazolidin-4-ones as inhibitors of the cytolytic protein perforin. J Med Chem 56:9542-55 (2014)  
Target
Name:
Perforin-1
Synonyms:
PERF_HUMAN PRF1
Type:
PROTEIN
Mol. Mass.:
61392.32
Organism:
Homo sapiens (Human)
Description:
ChEMBL_1285138
Residue:
555
  
Inhibitor
Name:
BDBM50445287
Synonyms:
CHEMBL3103906
Type:
Small organic molecule
Emp. Form.:
C16H11N3O2S2
Mol. Mass.:
341.407
SMILES:
O=C1NC(=S)N\C1=C\c1ccc(s1)-c1ccc2C(=O)NCc2c1
: