Target
Perforin-1
Ligand
BDBM50445301
Substrate
Meas. Tech.
ChEMBL_1285138 (CHEMBL3106784)
IC50
3030±n/a nM
Citation
 Spicer, JALena, GLyons, DMHuttunen, KMMiller, CKO'Connor, PDBull, MHelsby, NJamieson, SMDenny, WACiccone, ABrowne, KALopez, JARudd-Schmidt, JVoskoboinik, ITrapani, JA Exploration of a series of 5-arylidene-2-thioxoimidazolidin-4-ones as inhibitors of the cytolytic protein perforin. J Med Chem 56:9542-55 (2014)  
Target
Name:
Perforin-1
Synonyms:
PERF_HUMAN PRF1
Type:
PROTEIN
Mol. Mass.:
61392.32
Organism:
Homo sapiens (Human)
Description:
ChEMBL_1285138
Residue:
555
  
Inhibitor
Name:
BDBM50445301
Synonyms:
CHEMBL3104024
Type:
Small organic molecule
Emp. Form.:
C17H14N2O3S2
Mol. Mass.:
358.435
SMILES:
COC(=O)c1ccc(cc1C)-c1ccc(\C=C2\NC(=S)NC2=O)s1
: