Target
Focal adhesion kinase 1
Ligand
BDBM50445472
Substrate
Meas. Tech.
ChEMBL_1284304 (CHEMBL3108325)
IC50
16300±n/a nM
Citation
 El Amrani, MLai, DDebbab, AAly, AHSiems, KSeidel, CSchnekenburger, MGaigneaux, ADiederich, MFeger, DLin, WProksch, P Protein kinase and HDAC inhibitors from the endophytic fungus Epicoccum nigrum. J Nat Prod 77:49-56 (2014)  
Target
Name:
Focal adhesion kinase 1
Synonyms:
FADK 1 FAK1 FLT4 Focal adhesion kinase (FAK) Focal adhesion kinase 1 (FAK) Focal adhesion kinase-related nonkinase PTK2 Protein-tyrosine kinase 2 p125FAK | pp125FAK
Type:
Tyrosine-protein kinase
Mol. Mass.:
119233.17
Organism:
Homo sapiens (Human)
Description:
Q05397
Residue:
1052
  
Inhibitor
Name:
BDBM50445472
Synonyms:
CHEMBL3104852
Type:
Small organic molecule
Emp. Form.:
C10H10O6
Mol. Mass.:
226.1828
SMILES:
COC1OC(=O)c2c1c(C)c(O)c(O)c2O
: