Target
Proprotein convertase subtilisin/kexin type 7
Ligand
BDBM50446944
Substrate
Meas. Tech.
ChEMBL_1290739 (CHEMBL3117751)
Ki
14±n/a nM
Citation
 Kwiatkowska, ACouture, FLevesque, CLy, KDesjardins, RBeauchemin, SPrahl, ALammek, BNeugebauer, WDory, YLDay, R Design, synthesis, and structure-activity relationship studies of a potent PACE4 inhibitor. J Med Chem 57:98-109 (2014)  
Target
Name:
Proprotein convertase subtilisin/kexin type 7
Synonyms:
LPC PC7 PCSK7 Prohormone convertase PC7 Proprotein convertase subtilisin/kexin type 7 Subtilisin/kexin type 7 hPC8
Type:
PROTEIN
Mol. Mass.:
86233.43
Organism:
Homo sapiens (Human)
Description:
ChEMBL_1290739
Residue:
785
  
Inhibitor
Name:
BDBM50446944
Synonyms:
CHEMBL3115771
Type:
Small organic molecule
Emp. Form.:
C51H90N14O8
Mol. Mass.:
1027.3493
SMILES:
[#6]-[#6](-[#6])-[#6]-[#6@H](-[#7]-[#6](-[#6])=O)-[#6](=O)-[#7]-[#6@@H](-[#6]-[#6](-[#6])-[#6])-[#6](=O)-[#7]-[#6@@H](-[#6]-[#6](-[#6])-[#6])-[#6](=O)-[#7]-[#6@@H](-[#6]-[#6](-[#6])-[#6])-[#6](=O)-[#7]-[#6@@H](-[#6]-[#6]-[#6]\[#7]=[#6](/[#7])-[#7])-[#6](=O)-[#7]-[#6@@H](-[#6](-[#6])-[#6])-[#6](=O)-[#7]-[#6@@H](-[#6]-[#6]-[#6]-[#6]-[#7])-[#6](=O)-[#7]-[#6]-c1ccc(cc1)-[#6](-[#7])=[#7]
: