Target
Polyunsaturated fatty acid lipoxygenase ALOX12
Ligand
BDBM50447215
Substrate
Meas. Tech.
ChEMBL_1290553 (CHEMBL3116602)
IC50
700±n/a nM
Citation
 Luci, DKJameson, JBYasgar, ADiaz, GJoshi, NKantz, AMarkham, KPerry, SKuhn, NYeung, JKerns, EHSchultz, LHolinstat, MNadler, JLTaylor-Fishwick, DAJadhav, ASimeonov, AHolman, TRMaloney, DJ Synthesis and structure-activity relationship studies of 4-((2-hydroxy-3-methoxybenzyl)amino)benzenesulfonamide derivatives as potent and selective inhibitors of 12-lipoxygenase. J Med Chem 57:495-506 (2014)  
Target
Name:
Polyunsaturated fatty acid lipoxygenase ALOX12
Synonyms:
12-LOX 12LO Arachidonate 12-lipoxygenase LOG12 Platelet 12-lipoxygenase | Platelet-type lipoxygenase 12
Type:
Protein
Mol. Mass.:
75689.18
Organism:
Homo sapiens (Human)
Description:
P18054
Residue:
663
  
Inhibitor
Name:
BDBM50447215
Synonyms:
CHEMBL3113177 | US10752581, Compound 47
Type:
Small organic molecule
Emp. Form.:
C23H21N3O4S
Mol. Mass.:
435.496
SMILES:
COc1cccc(CNc2ccc(cc2)S(=O)(=O)Nc2cccc3ccncc23)c1O
: