Target
Polyunsaturated fatty acid lipoxygenase ALOX12
Ligand
BDBM50447184
Substrate
Meas. Tech.
ChEMBL_1290553 (CHEMBL3116602)
IC50
240±n/a nM
Citation
 Luci, DKJameson, JBYasgar, ADiaz, GJoshi, NKantz, AMarkham, KPerry, SKuhn, NYeung, JKerns, EHSchultz, LHolinstat, MNadler, JLTaylor-Fishwick, DAJadhav, ASimeonov, AHolman, TRMaloney, DJ Synthesis and structure-activity relationship studies of 4-((2-hydroxy-3-methoxybenzyl)amino)benzenesulfonamide derivatives as potent and selective inhibitors of 12-lipoxygenase. J Med Chem 57:495-506 (2014)  
Target
Name:
Polyunsaturated fatty acid lipoxygenase ALOX12
Synonyms:
12-LOX 12LO Arachidonate 12-lipoxygenase LOG12 Platelet 12-lipoxygenase | Platelet-type lipoxygenase 12
Type:
Protein
Mol. Mass.:
75689.18
Organism:
Homo sapiens (Human)
Description:
P18054
Residue:
663
  
Inhibitor
Name:
BDBM50447184
Synonyms:
CHEMBL3113169 | US10752581, Compound 39
Type:
Small organic molecule
Emp. Form.:
C22H21N3O4S2
Mol. Mass.:
455.55
SMILES:
COc1cccc(CNc2ccc(cc2)S(=O)(=O)Nc2nc3c(C)cccc3s2)c1O
: