Target
Tyrosine-protein kinase JAK3
Ligand
BDBM50447863
Substrate
Meas. Tech.
ChEMBL_1288559 (CHEMBL3118992)
IC50
576±n/a nM
Citation
 McDonnell, MEBian, HWrobel, JSmith, GRLiang, SMa, HReitz, AB Anilino-monoindolylmaleimides as potent and selective JAK3 inhibitors. Bioorg Med Chem Lett 24:1116-21 (2014)  
Target
Name:
Tyrosine-protein kinase JAK3
Synonyms:
JAK-3 JAK3_HUMAN Janus kinase 3 (JAK3) L-JAK | Leukocyte janus kinase
Type:
Protein
Mol. Mass.:
125111.08
Organism:
Homo sapiens (Human)
Description:
P52333
Residue:
1124
  
Inhibitor
Name:
BDBM50447863
Synonyms:
CHEMBL3114781
Type:
Small organic molecule
Emp. Form.:
C23H19FN4O3
Mol. Mass.:
418.4204
SMILES:
Fc1cc(NCCOc2cccc(NC3=C(C(=O)NC3=O)c3ccccc3)c2)ccn1
: