Target
Tyrosine-protein kinase JAK3
Ligand
BDBM50447864
Substrate
Meas. Tech.
ChEMBL_1288559 (CHEMBL3118992)
IC50
1387±n/a nM
Citation
 McDonnell, MEBian, HWrobel, JSmith, GRLiang, SMa, HReitz, AB Anilino-monoindolylmaleimides as potent and selective JAK3 inhibitors. Bioorg Med Chem Lett 24:1116-21 (2014)  
Target
Name:
Tyrosine-protein kinase JAK3
Synonyms:
JAK-3 JAK3_HUMAN Janus kinase 3 (JAK3) L-JAK | Leukocyte janus kinase
Type:
Protein
Mol. Mass.:
125111.08
Organism:
Homo sapiens (Human)
Description:
P52333
Residue:
1124
  
Inhibitor
Name:
BDBM50447864
Synonyms:
CHEMBL3114780
Type:
Small organic molecule
Emp. Form.:
C26H20F2N4O3
Mol. Mass.:
474.4588
SMILES:
Fc1cc(F)cc(NCCOc2cccc(NC3=C(C(=O)NC3=O)c3c[nH]c4ccccc34)c2)c1
: