Target
Tyrosine-protein kinase JAK3
Ligand
BDBM50447867
Substrate
Meas. Tech.
ChEMBL_1288559 (CHEMBL3118992)
IC50
1499±n/a nM
Citation
 McDonnell, MEBian, HWrobel, JSmith, GRLiang, SMa, HReitz, AB Anilino-monoindolylmaleimides as potent and selective JAK3 inhibitors. Bioorg Med Chem Lett 24:1116-21 (2014)  
Target
Name:
Tyrosine-protein kinase JAK3
Synonyms:
JAK-3 JAK3_HUMAN Janus kinase 3 (JAK3) L-JAK | Leukocyte janus kinase
Type:
Protein
Mol. Mass.:
125111.08
Organism:
Homo sapiens (Human)
Description:
P52333
Residue:
1124
  
Inhibitor
Name:
BDBM50447867
Synonyms:
CHEMBL3114777
Type:
Small organic molecule
Emp. Form.:
C25H21N5O3
Mol. Mass.:
439.4659
SMILES:
O=C1NC(=O)C(=C1Nc1cccc(OCCNc2ccccn2)c1)c1c[nH]c2ccccc12
: