Target
Tyrosine-protein kinase JAK3
Ligand
BDBM50447869
Substrate
Meas. Tech.
ChEMBL_1288559 (CHEMBL3118992)
IC50
179±n/a nM
Citation
 McDonnell, MEBian, HWrobel, JSmith, GRLiang, SMa, HReitz, AB Anilino-monoindolylmaleimides as potent and selective JAK3 inhibitors. Bioorg Med Chem Lett 24:1116-21 (2014)  
Target
Name:
Tyrosine-protein kinase JAK3
Synonyms:
JAK-3 JAK3_HUMAN Janus kinase 3 (JAK3) L-JAK | Leukocyte janus kinase
Type:
Protein
Mol. Mass.:
125111.08
Organism:
Homo sapiens (Human)
Description:
P52333
Residue:
1124
  
Inhibitor
Name:
BDBM50447869
Synonyms:
CHEMBL3114775
Type:
Small organic molecule
Emp. Form.:
C26H22FN5O3
Mol. Mass.:
471.483
SMILES:
Cn1cc(C2=C(Nc3cccc(OCCNc4ccnc(F)c4)c3)C(=O)NC2=O)c2ccccc12
: