Target
Tyrosine-protein kinase JAK3
Ligand
BDBM50335231
Substrate
Meas. Tech.
ChEMBL_1288559 (CHEMBL3118992)
IC50
0.500000±n/a nM
Citation
 McDonnell, MEBian, HWrobel, JSmith, GRLiang, SMa, HReitz, AB Anilino-monoindolylmaleimides as potent and selective JAK3 inhibitors. Bioorg Med Chem Lett 24:1116-21 (2014)  
Target
Name:
Tyrosine-protein kinase JAK3
Synonyms:
JAK-3 JAK3_HUMAN Janus kinase 3 (JAK3) L-JAK | Leukocyte janus kinase
Type:
Protein
Mol. Mass.:
125111.08
Organism:
Homo sapiens (Human)
Description:
P52333
Residue:
1124
  
Inhibitor
Name:
BDBM50335231
Synonyms:
3-{5-[4-(2-Hydroxy-2-methyl-propionyl)-piperazin-1-yl]-2-trifluoromethyl-phenyl}-4-(1H-indol-3-yl)-pyrrole-2,5-dione NIBR3049
Type:
Small organic molecule
Emp. Form.:
C27H25F3N4O4
Mol. Mass.:
526.507
SMILES:
CC(C)(O)C(=O)N1CCN(CC1)c1ccc(c(c1)C1=C(C(=O)NC1=O)c1c[nH]c2ccccc12)C(F)(F)F
: