Target
Tyrosine-protein kinase JAK2
Ligand
BDBM50447883
Substrate
Meas. Tech.
ChEMBL_1288560 (CHEMBL3118993)
IC50
1480±n/a nM
Citation
 McDonnell, MEBian, HWrobel, JSmith, GRLiang, SMa, HReitz, AB Anilino-monoindolylmaleimides as potent and selective JAK3 inhibitors. Bioorg Med Chem Lett 24:1116-21 (2014)  
Target
Name:
Tyrosine-protein kinase JAK2
Synonyms:
JAK-2 JAK2_HUMAN Janus kinase 2 (JAK2) | Janus kinase 2 (a protein tyrosine kinase)
Type:
Protein
Mol. Mass.:
130684.68
Organism:
Homo sapiens (Human)
Description:
O60674
Residue:
1132
  
Inhibitor
Name:
BDBM50447883
Synonyms:
CHEMBL3114761
Type:
Small organic molecule
Emp. Form.:
C27H22FN5O3
Mol. Mass.:
483.4937
SMILES:
Fc1cc(ccn1)N1CC[C@@H](C1)Oc1cccc(NC2=C(C(=O)NC2=O)c2c[nH]c3ccccc23)c1
: