Target
Tyrosine-protein kinase JAK2
Ligand
BDBM50447870
Substrate
Meas. Tech.
ChEMBL_1288560 (CHEMBL3118993)
IC50
2130±n/a nM
Citation
 McDonnell, MEBian, HWrobel, JSmith, GRLiang, SMa, HReitz, AB Anilino-monoindolylmaleimides as potent and selective JAK3 inhibitors. Bioorg Med Chem Lett 24:1116-21 (2014)  
Target
Name:
Tyrosine-protein kinase JAK2
Synonyms:
JAK-2 JAK2_HUMAN Janus kinase 2 (JAK2) | Janus kinase 2 (a protein tyrosine kinase)
Type:
Protein
Mol. Mass.:
130684.68
Organism:
Homo sapiens (Human)
Description:
O60674
Residue:
1132
  
Inhibitor
Name:
BDBM50447870
Synonyms:
CHEMBL3114774
Type:
Small organic molecule
Emp. Form.:
C25H20FN5O3
Mol. Mass.:
457.4564
SMILES:
Fc1cc(NCCOc2cccc(NC3=C(C(=O)NC3=O)c3c[nH]c4ccccc34)c2)ccn1
: