Target
Tyrosine-protein kinase JAK2
Ligand
BDBM50153461
Substrate
Meas. Tech.
ChEMBL_1288560 (CHEMBL3118993)
IC50
3850±n/a nM
Citation
 McDonnell, MEBian, HWrobel, JSmith, GRLiang, SMa, HReitz, AB Anilino-monoindolylmaleimides as potent and selective JAK3 inhibitors. Bioorg Med Chem Lett 24:1116-21 (2014)  
Target
Name:
Tyrosine-protein kinase JAK2
Synonyms:
JAK-2 JAK2_HUMAN Janus kinase 2 (JAK2) | Janus kinase 2 (a protein tyrosine kinase)
Type:
Protein
Mol. Mass.:
130684.68
Organism:
Homo sapiens (Human)
Description:
O60674
Residue:
1132
  
Inhibitor
Name:
BDBM50153461
Synonyms:
3-(1-(3-imidazol-1-ylpropyl)-1H-indol-3-yl)-4-anilino-1H-pyrrole-2,5-dione CHEMBL366266
Type:
Small organic molecule
Emp. Form.:
C24H21N5O2
Mol. Mass.:
411.4558
SMILES:
O=C1NC(=O)C(=C1Nc1ccccc1)c1cn(CCCn2ccnc2)c2ccccc12
: