Target
Tyrosine-protein kinase JAK1
Ligand
BDBM50447884
Substrate
Meas. Tech.
ChEMBL_1288561 (CHEMBL3118994)
IC50
564±n/a nM
Citation
 McDonnell, MEBian, HWrobel, JSmith, GRLiang, SMa, HReitz, AB Anilino-monoindolylmaleimides as potent and selective JAK3 inhibitors. Bioorg Med Chem Lett 24:1116-21 (2014)  
Target
Name:
Tyrosine-protein kinase JAK1
Synonyms:
JAK-1 JAK1A JAK1_HUMAN Janus kinase 1 (JAK1) | Janus kinase 1 JAK1
Type:
Protein
Mol. Mass.:
133293.73
Organism:
Homo sapiens (Human)
Description:
P23458
Residue:
1154
  
Inhibitor
Name:
BDBM50447884
Synonyms:
CHEMBL3114786
Type:
Small organic molecule
Emp. Form.:
C27H22FN5O3
Mol. Mass.:
483.4937
SMILES:
Fc1cc(ccn1)N1CCC(C1)Oc1cccc(NC2=C(C(=O)NC2=O)c2c[nH]c3ccccc23)c1
: