Target
Tyrosine-protein kinase JAK1
Ligand
BDBM50447863
Substrate
Meas. Tech.
ChEMBL_1288561 (CHEMBL3118994)
IC50
2174±n/a nM
Citation
 McDonnell, MEBian, HWrobel, JSmith, GRLiang, SMa, HReitz, AB Anilino-monoindolylmaleimides as potent and selective JAK3 inhibitors. Bioorg Med Chem Lett 24:1116-21 (2014)  
Target
Name:
Tyrosine-protein kinase JAK1
Synonyms:
JAK-1 JAK1A JAK1_HUMAN Janus kinase 1 (JAK1) | Janus kinase 1 JAK1
Type:
Protein
Mol. Mass.:
133293.73
Organism:
Homo sapiens (Human)
Description:
P23458
Residue:
1154
  
Inhibitor
Name:
BDBM50447863
Synonyms:
CHEMBL3114781
Type:
Small organic molecule
Emp. Form.:
C23H19FN4O3
Mol. Mass.:
418.4204
SMILES:
Fc1cc(NCCOc2cccc(NC3=C(C(=O)NC3=O)c3ccccc3)c2)ccn1
: