Target
Tyrosine-protein kinase JAK1
Ligand
BDBM50447869
Substrate
Meas. Tech.
ChEMBL_1288561 (CHEMBL3118994)
IC50
1784±n/a nM
Citation
 McDonnell, MEBian, HWrobel, JSmith, GRLiang, SMa, HReitz, AB Anilino-monoindolylmaleimides as potent and selective JAK3 inhibitors. Bioorg Med Chem Lett 24:1116-21 (2014)  
Target
Name:
Tyrosine-protein kinase JAK1
Synonyms:
JAK-1 JAK1A JAK1_HUMAN Janus kinase 1 (JAK1) | Janus kinase 1 JAK1
Type:
Protein
Mol. Mass.:
133293.73
Organism:
Homo sapiens (Human)
Description:
P23458
Residue:
1154
  
Inhibitor
Name:
BDBM50447869
Synonyms:
CHEMBL3114775
Type:
Small organic molecule
Emp. Form.:
C26H22FN5O3
Mol. Mass.:
471.483
SMILES:
Cn1cc(C2=C(Nc3cccc(OCCNc4ccnc(F)c4)c3)C(=O)NC2=O)c2ccccc12
: