Target
Tyrosine-protein kinase JAK1
Ligand
BDBM50447872
Substrate
Meas. Tech.
ChEMBL_1288561 (CHEMBL3118994)
IC50
2058±n/a nM
Citation
 McDonnell, MEBian, HWrobel, JSmith, GRLiang, SMa, HReitz, AB Anilino-monoindolylmaleimides as potent and selective JAK3 inhibitors. Bioorg Med Chem Lett 24:1116-21 (2014)  
Target
Name:
Tyrosine-protein kinase JAK1
Synonyms:
JAK-1 JAK1A JAK1_HUMAN Janus kinase 1 (JAK1) | Janus kinase 1 JAK1
Type:
Protein
Mol. Mass.:
133293.73
Organism:
Homo sapiens (Human)
Description:
P23458
Residue:
1154
  
Inhibitor
Name:
BDBM50447872
Synonyms:
CHEMBL3114772
Type:
Small organic molecule
Emp. Form.:
C25H20FN5O3
Mol. Mass.:
457.4564
SMILES:
Fc1cc(NCCOc2ccc(NC3=C(C(=O)NC3=O)c3c[nH]c4ccccc34)cc2)ccn1
: