Target
Tyrosine-protein kinase JAK1
Ligand
BDBM50447878
Substrate
Meas. Tech.
ChEMBL_1288561 (CHEMBL3118994)
IC50
300±n/a nM
Citation
 McDonnell, MEBian, HWrobel, JSmith, GRLiang, SMa, HReitz, AB Anilino-monoindolylmaleimides as potent and selective JAK3 inhibitors. Bioorg Med Chem Lett 24:1116-21 (2014)  
Target
Name:
Tyrosine-protein kinase JAK1
Synonyms:
JAK-1 JAK1A JAK1_HUMAN Janus kinase 1 (JAK1) | Janus kinase 1 JAK1
Type:
Protein
Mol. Mass.:
133293.73
Organism:
Homo sapiens (Human)
Description:
P23458
Residue:
1154
  
Inhibitor
Name:
BDBM50447878
Synonyms:
CHEMBL3114766
Type:
Small organic molecule
Emp. Form.:
C24H21N5O3
Mol. Mass.:
427.4552
SMILES:
O=C1NC(=O)C(=C1Nc1cccc(OCCCn2ccnc2)c1)c1c[nH]c2ccccc12
: