Target
Tyrosine-protein kinase JAK1
Ligand
BDBM50335231
Substrate
Meas. Tech.
ChEMBL_1288561 (CHEMBL3118994)
IC50
311±n/a nM
Citation
 McDonnell, MEBian, HWrobel, JSmith, GRLiang, SMa, HReitz, AB Anilino-monoindolylmaleimides as potent and selective JAK3 inhibitors. Bioorg Med Chem Lett 24:1116-21 (2014)  
Target
Name:
Tyrosine-protein kinase JAK1
Synonyms:
JAK-1 JAK1A JAK1_HUMAN Janus kinase 1 (JAK1) | Janus kinase 1 JAK1
Type:
Protein
Mol. Mass.:
133293.73
Organism:
Homo sapiens (Human)
Description:
P23458
Residue:
1154
  
Inhibitor
Name:
BDBM50335231
Synonyms:
3-{5-[4-(2-Hydroxy-2-methyl-propionyl)-piperazin-1-yl]-2-trifluoromethyl-phenyl}-4-(1H-indol-3-yl)-pyrrole-2,5-dione NIBR3049
Type:
Small organic molecule
Emp. Form.:
C27H25F3N4O4
Mol. Mass.:
526.507
SMILES:
CC(C)(O)C(=O)N1CCN(CC1)c1ccc(c(c1)C1=C(C(=O)NC1=O)c1c[nH]c2ccccc12)C(F)(F)F
: