Target
Tyrosine-protein kinase JAK3
Ligand
BDBM50447886
Substrate
Meas. Tech.
ChEMBL_1288559 (CHEMBL3118992)
IC50
163±n/a nM
Citation
 McDonnell, MEBian, HWrobel, JSmith, GRLiang, SMa, HReitz, AB Anilino-monoindolylmaleimides as potent and selective JAK3 inhibitors. Bioorg Med Chem Lett 24:1116-21 (2014)  
Target
Name:
Tyrosine-protein kinase JAK3
Synonyms:
JAK-3 JAK3_HUMAN Janus kinase 3 (JAK3) L-JAK | Leukocyte janus kinase
Type:
Protein
Mol. Mass.:
125111.08
Organism:
Homo sapiens (Human)
Description:
P52333
Residue:
1124
  
Inhibitor
Name:
BDBM50447886
Synonyms:
CHEMBL3114784
Type:
Small organic molecule
Emp. Form.:
C28H24FN5O3
Mol. Mass.:
497.5203
SMILES:
Fc1cc(ccn1)N1CCCC(C1)Oc1cccc(NC2=C(C(=O)NC2=O)c2c[nH]c3ccccc23)c1
: