Target
Histone-lysine N-methyltransferase SUV39H1
Ligand
BDBM50315537
Substrate
Meas. Tech.
ChEMBL_1294297 (CHEMBL3128974)
IC50
800±n/a nM
Citation
 Cherblanc, FLChapman, KLReid, JBorg, AJSundriyal, SAlcazar-Fuoli, LBignell, EDemetriades, MSchofield, CJDiMaggio, PABrown, RFuchter, MJ On the histone lysine methyltransferase activity of fungal metabolite chaetocin. J Med Chem 56:8616-25 (2013)  
Target
Name:
Histone-lysine N-methyltransferase SUV39H1
Synonyms:
H3-K9-HMTase 1 KMT1A Position-effect variegation 3-9 homolog SUV39H1 Su(var)3-9 homolog 1 | Suppressor of variegation 3-9 homolog 1
Type:
PROTEIN
Mol. Mass.:
47917.07
Organism:
Homo sapiens (Human)
Description:
ChEMBL_1473655
Residue:
412
  
Inhibitor
Name:
BDBM50315537
Synonyms:
CHEMBL1089316 | chaetocin
Type:
Small organic molecule
Emp. Form.:
C30H28N6O6S4
Mol. Mass.:
696.84
SMILES:
CN1C(=O)[C@@]23C[C@]4([C@H](Nc5ccccc45)N2C(=O)[C@]1(CO)SS3)[C@]12C[C@]34SS[C@](CO)(N(C)C3=O)C(=O)N4[C@H]1Nc1ccccc21
: