Target
Inosine-5'-monophosphate dehydrogenase 2
Ligand
BDBM50448689
Substrate
Meas. Tech.
ChEMBL_1297303 (CHEMBL3132089)
IC50
>200000±n/a nM
Citation
 Mizushina, YSuzuki-Fukudome, HTakeuchi, TTakemoto, KKuriyama, IYoshida, HKamisuki, SSugawara, F Formosusin A, a novel specific inhibitor of mammalian DNA polymeraseß from the fungus Paecilomyces formosus. Bioorg Med Chem 22:1070-6 (2014)  
Target
Name:
Inosine-5'-monophosphate dehydrogenase 2
Synonyms:
IMDH2_MOUSE | Impdh2
Type:
PROTEIN
Mol. Mass.:
55818.95
Organism:
Mus musculus
Description:
ChEMBL_1297303
Residue:
514
  
Inhibitor
Name:
BDBM50448689
Synonyms:
CHEMBL3127730
Type:
Small organic molecule
Emp. Form.:
C17H25NO3
Mol. Mass.:
291.3853
SMILES:
CCCC[C@@H](O)\C=C(/C)\C=C\C=C/C(=O)N1CCCC1=O
: