Target
DNA polymerase beta
Ligand
BDBM50448689
Substrate
Meas. Tech.
ChEMBL_1297321 (CHEMBL3132286)
IC50
35600±n/a nM
Citation
 Mizushina, YSuzuki-Fukudome, HTakeuchi, TTakemoto, KKuriyama, IYoshida, HKamisuki, SSugawara, F Formosusin A, a novel specific inhibitor of mammalian DNA polymeraseß from the fungus Paecilomyces formosus. Bioorg Med Chem 22:1070-6 (2014)  
Target
Name:
DNA polymerase beta
Synonyms:
DNA Polymerase beta Polb
Type:
PROTEIN
Mol. Mass.:
38334.34
Organism:
Rattus norvegicus
Description:
ChEMBL_1361926
Residue:
335
  
Inhibitor
Name:
BDBM50448689
Synonyms:
CHEMBL3127730
Type:
Small organic molecule
Emp. Form.:
C17H25NO3
Mol. Mass.:
291.3853
SMILES:
CCCC[C@@H](O)\C=C(/C)\C=C\C=C/C(=O)N1CCCC1=O
: