Target
Dihydrofolate reductase
Ligand
BDBM50448741
Substrate
Meas. Tech.
ChEMBL_1298221 (CHEMBL3130226)
Ki
0.019000±n/a nM
Citation
 Lam, THilgers, MTCunningham, MLKwan, BPNelson, KJBrown-Driver, VOng, VTrzoss, MHough, GShaw, KJFinn, J Structure-based design of new dihydrofolate reductase antibacterial agents: 7-(benzimidazol-1-yl)-2,4-diaminoquinazolines. J Med Chem 57:651-68 (2014)  
Target
Name:
Dihydrofolate reductase
Synonyms:
DYR_STAAU Dihydrofolate reductase Tetrahydrofolate dehydrogenase | folA
Type:
Enzyme
Mol. Mass.:
18249.71
Organism:
Staphylococcus aureus
Description:
Residue:
159
  
Inhibitor
Name:
BDBM50448741
Synonyms:
CHEMBL3128017
Type:
Small organic molecule
Emp. Form.:
C21H19N7O2S
Mol. Mass.:
433.486
SMILES:
COc1cc2nc(-c3nccs3)n(-c3cc4nc(N)nc(N)c4cc3C)c2cc1OC
: