Target
Dihydrofolate reductase
Ligand
BDBM50448756
Substrate
Meas. Tech.
ChEMBL_1298221 (CHEMBL3130226)
Ki
0.012000±n/a nM
Citation
 Lam, THilgers, MTCunningham, MLKwan, BPNelson, KJBrown-Driver, VOng, VTrzoss, MHough, GShaw, KJFinn, J Structure-based design of new dihydrofolate reductase antibacterial agents: 7-(benzimidazol-1-yl)-2,4-diaminoquinazolines. J Med Chem 57:651-68 (2014)  
Target
Name:
Dihydrofolate reductase
Synonyms:
DYR_STAAU Dihydrofolate reductase Tetrahydrofolate dehydrogenase | folA
Type:
Enzyme
Mol. Mass.:
18249.71
Organism:
Staphylococcus aureus
Description:
Residue:
159
  
Inhibitor
Name:
BDBM50448756
Synonyms:
CHEMBL3128026 | US8835445, 21
Type:
Small organic molecule
Emp. Form.:
C21H18N6S
Mol. Mass.:
386.473
SMILES:
Cc1cc2nc(-c3ccsc3)n(-c3ccc4c(N)nc(N)nc4c3)c2cc1C
: