Target
5-hydroxytryptamine receptor 3A/3B
Ligand
BDBM82561
Substrate
Meas. Tech.
ChEMBL_3380 (CHEMBL620616)
IC50
22±n/a nM
Citation
 Swain, CJBaker, RKneen, CHerbert, RMoseley, JSaunders, JSeward, EMStevenson, GIBeer, MStanton, J Novel 5-HT3 antagonists: indol-3-ylspiro(azabicycloalkane-3,5'(4'H)-oxazoles). J Med Chem 35:1019-31 (1992)  
Target
Name:
5-hydroxytryptamine receptor 3A/3B
Synonyms:
Serotonin 3 (5-HT3) receptor | Serotonin 3a (5-HT3a)/3b (5-HT3b) receptor
Type:
Mol. Mass.:
Description:
ASSAY_ID of EBI is 2974
Components:
This complex has 2 components.
Component 1
Name:
5-hydroxytryptamine receptor 3B
Synonyms:
5HT3B_RAT Serotonin (5-HT) receptor
Type:
PROTEIN
Mol. Mass.:
50328.78
Organism:
Rattus norvegicus
Description:
EBI_11885
Residue:
437
  
Component 2
Name:
5-hydroxytryptamine receptor 3A
Synonyms:
5-HT3 5HT3A_RAT Htr3 Serotonin (5-HT) receptor | Zacopride site-R
Type:
Enzyme Catalytic Domain
Mol. Mass.:
55428.70
Organism:
RAT
Description:
5-HT3 HTR3A RAT::P35563
Residue:
483
  
Inhibitor
Name:
BDBM82561
Synonyms:
CAS_40796-97-2 Tropanyl-3,5 dichlorobenzoate
Type:
Small organic molecule
Emp. Form.:
C15H17Cl2NO2
Mol. Mass.:
314.207
SMILES:
CN1[C@H]2CC[C@@H]1C[C@@H](C2)OC(=O)c1cc(Cl)cc(Cl)c1
: