Target
Beta-3 adrenergic receptor
Ligand
BDBM50422409
Substrate
Meas. Tech.
ChEMBL_352666 (CHEMBL862145)
EC50
6.3±n/a nM
Citation
 Uehling, DEShearer, BGDonaldson, KHChao, EYDeaton, DNAdkison, KKBrown, KKCariello, NFFaison, WLLancaster, MELin, JHart, RMilliken, TOPaulik, MASherman, BWSugg, EECowan, C Biarylaniline phenethanolamines as potent and selective beta3 adrenergic receptor agonists. J Med Chem 49:2758-71 (2006)  
Target
Name:
Beta-3 adrenergic receptor
Synonyms:
ADRB3 ADRB3_HUMAN Beta-2 adrenergic receptor and beta-3 adrenergic receptor Beta-3 adrenoreceptor | adrenergic Beta3
Type:
G Protein-Coupled Receptor (GPCR)
Mol. Mass.:
43534.88
Organism:
Homo sapiens (Human)
Description:
Residue:
408
  
Inhibitor
Name:
BDBM50422409
Synonyms:
CHEMBL347582
Type:
Small organic molecule
Emp. Form.:
C26H30ClN3O4S
Mol. Mass.:
516.052
SMILES:
C[C@H](CNc1cccc(CC(=O)NS(=O)(=O)c2ccc(C)cc2)c1)NC[C@H](O)c1cccc(Cl)c1
: