Target
Solute carrier organic anion transporter family member 2B1
Ligand
BDBM50101853
Substrate
Meas. Tech.
ChEMBL_836786 (CHEMBL2075311)
IC50
36±n/a nM
Citation
 Nishio, TAdachi, HNakagomi, RTokui, TSato, ETanemoto, MFujiwara, KOkabe, MOnogawa, TSuzuki, TNakai, DShiiba, KSuzuki, MOhtani, HKondo, YUnno, MIto, SIinuma, KNunoki, KMatsuno, SAbe, T Molecular identification of a rat novel organic anion transporter moat1, which transports prostaglandin D(2), leukotriene C(4), and taurocholate. Biochem Biophys Res Commun 275:831-8 (2000)  
Target
Name:
Solute carrier organic anion transporter family member 2B1
Synonyms:
Oatp2b1 SO2B1_RAT Slco2b1 | Solute carrier family 21 member 9
Type:
PROTEIN
Mol. Mass.:
74232.20
Organism:
Rattus norvegicus
Description:
ChEMBL_104639
Residue:
682
  
Inhibitor
Name:
BDBM50101853
Synonyms:
(11alpha,13E,15S)-11,15-dihydroxy-9-oxoprost-13-en-1-oic acid 11alpha,15alpha-dihydroxy-9-oxo-13-trans-prostenoic acid CHEMBL495 PGE1 | prostaglandin E1
Type:
Small organic molecule
Emp. Form.:
C20H34O5
Mol. Mass.:
354.481
SMILES:
CCCCC[C@H](O)\C=C\[C@H]1[C@H](O)CC(=O)[C@@H]1CCCCCCC(O)=O
: