Target
Prostaglandin G/H synthase 2
Ligand
BDBM50057518
Substrate
Meas. Tech.
ChEMBL_1337744 (CHEMBL3240193)
IC50
160±n/a nM
Citation
 Yamakawa, NSuzuki, KYamashita, YKatsu, THanaya, KShoji, MSugai, TMizushima, T Structure-activity relationship of celecoxib and rofecoxib for the membrane permeabilizing activity. Bioorg Med Chem 22:2529-34 (2014)  
Target
Name:
Prostaglandin G/H synthase 2
Synonyms:
COX2 Cyclooxygenase 2 (COX-2) Cyclooxygenase-2 (COX-2 AA) Cyclooxygenase-2 (COX-2) PGH2_HUMAN PHS II Prostaglandin E synthase/G/H synthase 2 Prostaglandin-endoperoxide synthase 2
Type:
Enzyme
Mol. Mass.:
69003.89
Organism:
Homo sapiens (Human)
Description:
Recombinant Cox-2 provided by Cayman (Cayman Chemical Co.,Ann Arbor, MI).
Residue:
604
  
Inhibitor
Name:
BDBM50057518
Synonyms:
4-(5-Phenyl-3-trifluoromethyl-pyrazol-1-yl)-benzenesulfonamide CHEMBL29920
Type:
Small organic molecule
Emp. Form.:
C16H12F3N3O2S
Mol. Mass.:
367.346
SMILES:
NS(=O)(=O)c1ccc(cc1)-n1nc(cc1-c1ccccc1)C(F)(F)F
: